{"text_format":"1","workbook":"xlsx","n_sheets":15,"sheets":["Dane wyjściowe","Dane kadrowe","PRACOWNICY","Pracownicy podsuma","MASZYNY SPRZĘT","MASZYNY SPRZĘT ceny","CHEMIA","HIGIENA","ZIMA","ZIMA ceny","POZOSTAŁE","POZOSTAŁE ceny","PODSUMOWANIE","Karta obiektu","Wykorzystanie budżetu"],"not_rendered":{"charts":0,"images":0,"macros":1,"external_links":0,"defined_names":0,"comments":0,"pivot_tables":1},"unopened":[],"bounds":{"document_bytes":16777216,"sheet_cells":100000,"rows_first":2000,"rows_last":500,"rows_between":2000,"halvings":0,"cell_chars":16384,"cell_head_chars":4096},"cells_cut":0,"cells_raw":0,"read":"whole","date_system":"1900"}

{"sheet":"Dane wyjściowe","index":0,"n_rows":85,"n_cols":30,"rows_kept":85,"cut":false,"hidden":true,"merged":[[0,14,0,15],[20,8,24,8],[18,9,18,16]]}
["SEZON","ILOŚĆ PRACUJĄCYCH MIESIĘCY",null,"RODZAJ UMOWY","WSKAŹNIK UBRUTTOWIENIA","WSKAŹNIK OPERACYJNY",null,null,"DOJAZD",null,"NARODOWOŚĆ",null,"KSIĘGOWOŚĆ",null,"Rezerwy (liczone od podst. wynagrodzenia mies. brutto) - tylko do UOP",null,null,"MASZYNY",null,null,"SPÓŁKI",null,"RODZAJ CZYNNOŚCI",null,"Odzież",null,"Zima"]
["Cały rok",12,null,"O pracę",1.65,1.6840352075556022,null,null,2.39,null,"Polak",null,30,null,"Chorobowe",0.05,null,"Postojowe",null,null,"DL2 SP. Z O.O.",null,"Doczyszczanie koszy na śmieci – mycie pojemników wewnątrz, klap od śmietników ",null,null,null,11,null,"data teraz",{"$f":"TODAY()","v":"2026-06-11"}]
["Lato",7,null,"Zlecenie",1.65,1.6095833333333336,null,null,null,null,"Obcokrajowiec",null,15,null,"Urlopowe",0.1,null,"Dojazd",null,null,"DL2 SP. Z O.O. SP.K.",null,"Dystrybutor na wodę – kratka ociekająca na wodę ",null,"X",null,12,null,"miesiąc teraz",{"$f":"MONTH(AD2)","v":6}]
["Zima",5,null,"Agencja",1.7716666666666667,1.7716666666666667,null,null,null,null,null,null,null,null,"Administracja",null,null,null,null,null,"GLOBAL DL SP. Z O.O.",null,"Mycie drzwi od zmywarki od wewnątrz – doczyszczenie boków ",null,null,null,1,null,"czy zima",{"$f":"IF(IFERROR(VLOOKUP(AD3,AA:AA,1,0),\"nie\")=\"nie\",\"nie\",\"tak\")","v":"nie"}]
[null,null,null,"O pracę z dojazdem",2.1316667153918001,1.8440273210166083,null,null,null,null,null,null,null,null,null,null,null,null,null,null,"GLOBAL DL SP. Z O.O. SP.K.",null,"Mycie lodówek od wewnątrz – przy przekładaniu produktów – bieżące zabrudzenia ",null,null,null,2]
[null,null,null,"O pracę z mieszkaniem",2.1906176208275099,1.9029782264523198,null,null,null,null,null,null,null,null,null,null,null,null,null,null,"HORIZONT  SP. Z O.O. SP.K.",null,"Mycie lodówek z zewnątrz ",null,null,null,3]
[null,null,null,"O pracę z dojazdem i mieszkaniem",2.3506097342885175,2.0629703399133259,null,null,null,null,null,null,null,null,null,null,null,null,null,null,null,null,"Mycie lodówki"]
[null,null,null,"Agencja z dojazdem",1.89,1.89,null,null,null,null,null,null,null,null,null,null,null,null,null,null,null,null,"Mycie mikrofali"]
{"$rows_left_out":78}
{"sheet":"Dane kadrowe","index":1,"n_rows":53,"n_cols":7,"rows_kept":53,"cut":false,"hidden":true,"merged":[[0,0,0,6],[43,0,44,0],[43,1,43,2],[43,4,44,4],[43,5,43,6],[40,0,40,6],[29,0,29,6]]}
["Umowa o pracę"]
[]
["Wskaźniki dla UoP liczone na podstawie stawki netto/rbh [zł]"]
[]
["stawka netto/rbh [zł]","wskaźnik ubruttowienia"]
[13,1.3614999999999999]
[13.5,1.3639021164021163]
[14,1.3654999999999999]
{"$rows_left_out":46}
{"sheet":"PRACOWNICY","index":2,"n_rows":45,"n_cols":29,"rows_kept":45,"cut":false,"hidden":false,"merged":[[29,2,29,9],[3,2,3,28],[1,2,1,28],[25,2,25,9]]}
[]
[null,null,"PRACOWNICY"]
[]
[null,null,"WYKAZ PRACOWNIKÓW"]
["Podsumowanie",null,"Lp","Typ pracownika","Opis stanowiska","Sezon","Rodzaj umowy","Od godziny","Do godziny","rbh/dzień","Ilość osób","Ilość dni pracujących w tygodniu ","Ilość dni w tygodniu","Średnio dni w miesiącu","Ilośc miesięcy w roku","Ilość pracujących miesięcy","rbh/m-c","zł netto/rbh stawka minimum","nowa stawka zł netto/rbh","zł netto/rbh","Netto pracownika","Brutto pracownika","Wskaźnik pracodawcy ZUS","Brutto pracodawcy","Chorobowe","Urlopowe","Zakwaterowanie","Dojazd","Koszt pracodawcy"]
[{"$f":"IF(G6=\"\",\"\",G6&\" - stawka \"&TEXT(R6,\"# ##0,00 zł\"))","v":"zlecenie - stawka 24,50 zł"},null,1,"Pracownik porządkowy - umowa zlecenie",null,"Cały rok",{"$f":"IF(D6=\"\",\"\",MID(D6,FIND(\"umowa\",D6)+6,100))","v":"zlecenie"},null,null,{"$f":"I6-H6+IF(I6<H6,1,0)","v":0},null,null,7,29.4,12,{"$f":"IFERROR(VLOOKUP(F6,'Dane wyjściowe'!$A$1:$B$4,2,0),\"\")","v":12},{"$f":"IFERROR(CEILING(K6*J6*N6/M6*L6*P6/O6,TIME(1,0,0))*24,\"\")","v":0},{"$f":"IF(D6=\"\",\"\",VLOOKUP(D6,$D$36:$E$46,2,0))","v":24.5},null,{"$f":"IF(R6=\"\",\"\",MAX(R6:S6))","v":24.5},{"$f":"IF(Q6=\"\",\"\",Q6*T6)","v":0},{"$f":"IFERROR(IF(LEFT(G6,7)=\"O pracę\",U6*VLOOKUP(PRACOWNICY!T6,'Dane kadrowe'!$A$5:$B$26,2,1),U6*'Dane kadrowe'!$D$34),\"\")","v":0},{"$f":"IF(Q6=\"\",\"\",'Dane kadrowe'!$B$53)","v":0.20480000000000001},{"$f":"IF(V6=\"\",\"\",V6*(1+W6))","v":0},{"$f":"IF(LEFT(G6,7)='Dane wyjściowe'!$D$2,5%*X6,\"\")","v":""},{"$f":"IF(LEFT(G6,7)='Dane wyjściowe'!$D$2,10%*X6,\"\")","v":""},null,null,{"$f":"IF(X6=\"\",\"\",SUM(X6:AB6))","v":0}]
[{"$f":"IF(G7=\"\",\"\",G7&\" - stawka \"&TEXT(R7,\"# ##0,00 zł\"))","v":"zlecenie - stawka 24,50 zł"},null,2,"Pracownik porządkowy - umowa zlecenie",null,"Cały rok",{"$f":"IF(D7=\"\",\"\",MID(D7,FIND(\"umowa\",D7)+6,100))","v":"zlecenie"},null,null,{"$f":"I7-H7+IF(I7<H7,1,0)","v":0},null,null,7,29.4,12,{"$f":"IFERROR(VLOOKUP(F7,'Dane wyjściowe'!$A$1:$B$4,2,0),\"\")","v":12},{"$f":"IFERROR(CEILING(K7*J7*N7/M7*L7*P7/O7,TIME(1,0,0))*24,\"\")","v":0},24.5,null,{"$f":"IF(R7=\"\",\"\",MAX(R7:S7))","v":24.5},{"$f":"IF(Q7=\"\",\"\",Q7*T7)","v":0},{"$f":"IFERROR(IF(LEFT(G7,7)=\"O pracę\",U7*VLOOKUP(PRACOWNICY!T7,'Dane kadrowe'!$A$5:$B$26,2,1),U7*'Dane kadrowe'!$D$34),\"\")","v":0},{"$f":"IF(Q7=\"\",\"\",'Dane kadrowe'!$B$53)","v":0.20480000000000001},{"$f":"IF(V7=\"\",\"\",V7*(1+W7))","v":0},{"$f":"IF(LEFT(G7,7)='Dane wyjściowe'!$D$2,5%*X7,\"\")","v":""},{"$f":"IF(LEFT(G7,7)='Dane wyjściowe'!$D$2,10%*X7,\"\")","v":""},null,null,{"$f":"IF(X7=\"\",\"\",SUM(X7:AB7))","v":0}]
["",null,3,null,null,null,"",null,null,0,null,null,7,29.4,12,{"$f":"IFERROR(VLOOKUP(F8,'Dane wyjściowe'!$A$1:$B$4,2,0),\"\")","v":""},"","",null,"","",{"$f":"IFERROR(IF(LEFT(G8,7)=\"O pracę\",U8*VLOOKUP(PRACOWNICY!T8,'Dane kadrowe'!$A$5:$B$26,2,1),U8*'Dane kadrowe'!$D$34),\"\")","v":""},{"$f":"IF(Q8=\"\",\"\",'Dane kadrowe'!$B$53)","v":""},{"$f":"IF(V8=\"\",\"\",V8*(1+W8))","v":""},{"$f":"IF(LEFT(G8,7)='Dane wyjściowe'!$D$2,5%*X8,\"\")","v":""},{"$f":"IF(LEFT(G8,7)='Dane wyjściowe'!$D$2,10%*X8,\"\")","v":""},null,null,{"$f":"IF(X8=\"\",\"\",SUM(X8:AB8))","v":""}]
{"$rows_left_out":38}
{"sheet":"Pracownicy podsuma","index":3,"n_rows":6,"n_cols":7,"rows_kept":6,"cut":false,"hidden":true,"merged":[]}
[]
[null,"Etykiety wierszy","Suma z rbh/m-c","Suma z Brutto pracodawcy z rezerwami"]
[null,null,0,0,null,null,"tabela potrzebna wyłącznie do Wykorzystania budżetu"]
[null,"Umowa o pracę - stawka 15,00 zł",168,4018.273056]
[null,"Umowa zlecenie - stawka 13,50 zł",252,5424.6686256000003]
[null,"Suma końcowa",420,9442.9416816000012]

{"sheet":"MASZYNY SPRZĘT","index":4,"n_rows":106,"n_cols":21,"rows_kept":106,"cut":false,"hidden":false,"merged":[[105,3,105,14],[81,3,81,16],[57,3,57,16],[3,3,3,16],[1,3,1,16],[55,3,55,14],[79,3,79,14],[93,3,93,14],[104,3,104,15],[102,3,102,14],[95,3,95,16]]}
[]
[null,null,null,"MASZYNY / SPRZĘT"]
[]
[null,null,null,"Maszyny sprzątające"]
[null,null,{"$f":"COUNTIF(C7:C29,2)","v":0},"Lp","Nazwa maszyny","Wydajność maszyny mkw/h","Szerokość czyszczenia mm","Czas pracy maszyny","Cena","Cena z wynajmem","Okres spłaty [msc]","Miesięczny koszt","Eksploatacja [msc]","Cena 1 szt. do oferty [msc]","Ilość maszyn","Kwota do oferty","Eksploatacja kwotowo (1 szt.)","Czy uwzględniać","Wskaźnik eksploatacji"]
[{"$f":"COUNTIF($R$6:R6,\"tak\")","v":0},{"$f":"IF(A6>=MAX($A6:A$6),\"TAK\",\"NIE\")","v":"TAK"},{"$f":"IF(B6=\"TAK\",A6,\"\")","v":0},1,"Tennant T16 lit-jon + H2O + ES","8200/7000",910,"ok. 4h",103500,{"$f":"I6*1.2","v":124200},36,{"$f":"IFERROR((J6/K6)*O6,0)","v":0},{"$f":"L6*0.2","v":0},{"$f":"IFERROR((J6/K6)*S6,0)","v":4140},0,{"$f":"L6*S6","v":0},{"$f":"J6*S6-J6","v":24840},{"$f":"IF(O6>0,\"tak\",\"nie\")","v":"nie"},1.2]
[{"$f":"COUNTIF($R$6:R7,\"tak\")","v":0},{"$f":"IF(A7>MAX($A$6:A6),\"TAK\",\"NIE\")","v":"NIE"},{"$f":"IF(B7=\"TAK\",A7,\"\")","v":""},{"$f":"D6+1","v":2},"Tennant T16 lit-jon + H2O","8200/7000",910,"ok. 4h",96000,{"$f":"I7*1.2","v":115200},36,{"$f":"IFERROR((J7/K7)*O7,0)","v":0},0,{"$f":"IFERROR((J7/K7)*S7,0)","v":3840},0,{"$f":"L7*S7","v":0},{"$f":"J7*S7-J7","v":23040},{"$f":"IF(O7>0,\"tak\",\"nie\")","v":"nie"},1.2]
[{"$f":"COUNTIF($R$6:R8,\"tak\")","v":0},{"$f":"IF(A8>MAX($A$6:A7),\"TAK\",\"NIE\")","v":"NIE"},"",{"$f":"D7+1","v":3},"Tennant T16 lit-jon","8200/7000",910,"ok. 4h",90000,{"$f":"I8*1.2","v":108000},36,{"$f":"IFERROR((J8/K8)*O8,0)","v":0},{"$f":"L8*0.2","v":0},{"$f":"IFERROR((J8/K8)*S8,0)","v":3600},0,{"$f":"L8*S8","v":0},{"$f":"J8*S8-J8","v":21600},"nie",1.2]
{"$rows_left_out":99}
{"sheet":"MASZYNY SPRZĘT ceny","index":5,"n_rows":106,"n_cols":20,"rows_kept":106,"cut":false,"hidden":true,"merged":[[104,3,104,4],[1,3,1,16],[3,3,3,16],[57,3,57,16],[81,3,81,16],[95,3,95,15],[102,3,102,14],[55,3,55,14],[79,3,79,14],[93,3,93,14]]}
[]
[null,null,null,"MASZYNY / SPRZĘT"]
[]
[null,null,null,"Maszyny sprzątające"]
[null,null,{"$f":"COUNTIF(C7:C25,2)","v":1},"Lp","Nazwa maszyny","Wydajność maszyny mkw/h","Szerokość czyszczenia mm","Czas pracy maszyny","Cena","Cena z leasingiem","Okres spłaty [msc]","Koszt leasingu [msc]","Eksploatacja [msc]","Cena 1 szt. do oferty [msc]","Ilość maszyn","Kwota do oferty","Eksploatacja kwotowo (1 szt.)","Czy uwzględniać","Wskaźnik eksploatacji"]
[{"$f":"COUNTIF($R$6:R6,\"tak\")","v":1},{"$f":"IF(A6>=MAX($A6:A$6),\"TAK\",\"NIE\")","v":"TAK"},{"$f":"IF(B6=\"TAK\",A6,\"\")","v":1},1,"Tennant T16 lit-jon + H2O + ES","8200/7000",910,"ok. 4h",103500,{"$f":"I6*1.2","v":124200},36,{"$f":"IFERROR((J6/K6)*O6,0)","v":3450},{"$f":"L6*0.2","v":690},{"$f":"IFERROR((J6/K6)*S6,0)","v":4140},1,{"$f":"L6*S6","v":4140},{"$f":"J6*S6-J6","v":24840},{"$f":"IF(O6>0,\"tak\",\"nie\")","v":"tak"},1.2]
[{"$f":"COUNTIF($R$6:R7,\"tak\")","v":2},{"$f":"IF(A7>MAX($A$6:A6),\"TAK\",\"NIE\")","v":"TAK"},{"$f":"IF(B7=\"TAK\",A7,\"\")","v":2},{"$f":"D6+1","v":2},"Tennant T16 lit-jon + H2O","8200/7001",911,"ok.4h",96000,{"$f":"I7*1.2","v":115200},36,{"$f":"IFERROR((J7/K7)*O7,0)","v":3200},640,{"$f":"IFERROR((J7/K7)*S7,0)","v":3840},1,3840,{"$f":"J7*S7-J7","v":23040},{"$f":"IF(O7>0,\"tak\",\"nie\")","v":"tak"},1.2]
[{"$f":"COUNTIF($R$6:R8,\"tak\")","v":3},{"$f":"IF(A8>MAX($A$6:A7),\"TAK\",\"NIE\")","v":"TAK"},{"$f":"IF(B8=\"TAK\",A8,\"\")","v":3},{"$f":"D7+1","v":3},"Tennant T16 lit-jon","8200/7000",910,"ok. 4h",90000,{"$f":"I8*1.2","v":108000},36,{"$f":"IFERROR((J8/K8)*O8,0)","v":3000},{"$f":"L8*0.2","v":600},{"$f":"IFERROR((J8/K8)*S8,0)","v":3600},1,{"$f":"L8*S8","v":3600},{"$f":"J8*S8-J8","v":21600},"tak",1.2]
{"$rows_left_out":99}
{"sheet":"CHEMIA","index":6,"n_rows":55,"n_cols":6,"rows_kept":55,"cut":false,"hidden":false,"merged":[[53,1,53,5],[1,1,1,5],[3,1,3,5],[13,1,13,5],[23,1,23,5],[33,1,33,5],[43,1,43,5]]}
[]
[null,"PIELĘGNACJA /  CHEMIA"]
[]
[null,"Biura"]
[null,"Lp","Przedział metrażu mkw","Metraż","Współczynnik","Ryczałt"]
[null,1,"<500",null,0.2,{"$f":"E6*D6","v":0}]
[null,2,"do 1000",null,0.15,0]
[null,3,"do 2000",null,0.125,0]
{"$rows_left_out":48}
{"sheet":"HIGIENA","index":7,"n_rows":46,"n_cols":6,"rows_kept":46,"cut":false,"hidden":false,"merged":[[44,1,44,5],[1,1,1,5],[3,1,3,5],[10,1,10,5],[17,1,17,5],[24,1,24,5],[34,1,34,5]]}
[]
[null,"HIGIENA"]
[]
[null,"Biura"]
[null,"Lp","Standard","Ilość osób","Ryczałt osoba","Ryczałt"]
[null,1,"Niski",null,12,{"$f":"D6*E6","v":0}]
[null,2,"Średni",null,14,{"$f":"D7*E7","v":0}]
[null,3,"Wysoki",null,16,{"$f":"D8*E8","v":0}]
{"$rows_left_out":39}
{"sheet":"ZIMA","index":8,"n_rows":40,"n_cols":11,"rows_kept":40,"cut":false,"hidden":false,"merged":[[1,1,1,9],[28,1,28,6],[38,1,38,8],[18,1,18,8],[12,1,12,8],[3,1,3,9]]}
[]
[null,"ZIMA"]
[]
[null,"Sprzęt ciężki - na miejscu "]
[null,"Lp","Nazwa maszyny","Ilośc maszyn","rbh/dzień","Postojowe","zł/rbh","Dni pracujące / m-c","Kwota do oferty","Budżet na roboczogodziny","Budżet na postojowe "]
[null,1,"Traktor duży - zima",0,0,4500,150,0,{"$f":"((D6*H6*E6*G6*5))/12+((F6*5*D6)/12)","v":0},{"$f":"I6*12-K6","v":0},{"$f":"F6*5*D6","v":0}]
[null,{"$f":"B6+1","v":2},"Traktor mały - zima",0,0,2500,120,0,{"$f":"((D7*H7*E7*G7*5))/12+((F7*5*D7)/12)","v":0},{"$f":"I7*12-K7","v":0},{"$f":"F7*5*D7","v":0}]
[null,{"$f":"B7+1","v":3},"Ładowarka",0,0,3000,150,0,0,0,0]
{"$rows_left_out":33}
{"sheet":"ZIMA ceny","index":9,"n_rows":40,"n_cols":11,"rows_kept":40,"cut":false,"hidden":true,"merged":[[38,1,38,8],[1,1,1,9],[3,1,3,9],[12,1,12,8],[18,1,18,8],[28,1,28,6]]}
[]
[null,"ZIMA"]
[]
[null,"Sprzęt ciężki - na miejscu "]
[null,"Lp","Nazwa maszyny","Ilośc maszyn","rbh/dzień","Postojowe","zł/rbh","Dni pracujące","Kwota do oferty","Budżet na roboczogodziny","Budżet na postojowe "]
[null,1,"Traktor duży - zima",0,0,4500,150,0,{"$f":"((D6*H6*E6*G6*5))/12+((F6*5*D6)/12)","v":0},{"$f":"I6*12-K6","v":0},{"$f":"F6*5*D6","v":0}]
[null,{"$f":"B6+1","v":2},"Traktor mały - zima",0,0,2500,120,0,{"$f":"((D7*H7*E7*G7*5))/12+((F7*5*D7)/12)","v":0},{"$f":"I7*12-K7","v":0},{"$f":"F7*5*D7","v":0}]
[null,{"$f":"B7+1","v":3},"Ładowarka",0,0,3000,150,0,0,0,0]
{"$rows_left_out":33}
{"sheet":"POZOSTAŁE","index":10,"n_rows":29,"n_cols":12,"rows_kept":29,"cut":false,"hidden":false,"merged":[[1,3,1,9],[22,3,22,9],[27,3,27,9],[3,3,3,9],[23,8,23,9],[24,8,24,9]]}
[]
[null,null,null,"POZOSTAŁE KOSZTY "]
[]
[null,null,null,"POZOSTAŁE KOSZTY"]
[null,null,null,"Lp","Nazwa","ilość / mkw","krotność w roku","Cena za jednostkę","Cena","Kwota do oferty [msc]"]
[null,null,null,1,"ZAKUP ODZIEŻY - pracownik biurowo-socjalny",0,1,210,{"$f":"IF(F6=\"\",\"\",F6*G6*H6)","v":0},{"$f":"IFERROR(I6/12,\"\")","v":0}]
[null,null,null,{"$f":"D6+1","v":2},"ZAKUP ODZIEŻY - pracownik magazynowo-produkcyjny",0,1,287,{"$f":"IF(F7=\"\",\"\",F7*G7*H7)","v":0},{"$f":"IFERROR(I7/12,\"\")","v":0}]
[null,null,{"$f":"COUNTIF(C9:C16,2)","v":0},{"$f":"D7+1","v":3},"Pranie strojów roboczych",{"$f":"F6+F7","v":0},12,20,{"$f":"IF(F8=\"\",\"\",F8*G8*H8)","v":0},0]
{"$rows_left_out":22}
{"sheet":"POZOSTAŁE ceny","index":11,"n_rows":29,"n_cols":12,"rows_kept":29,"cut":false,"hidden":true,"merged":[[27,3,27,9],[1,3,1,9],[3,3,3,9],[22,3,22,9],[23,8,23,9],[24,8,24,9]]}
[]
[null,null,null,"POZOSTAŁE KOSZTY "]
[]
[null,null,null,"POZOSTAŁE KOSZTY"]
[null,null,null,"Lp","Nazwa","ilość / mkw","krotność w roku","Cena za jednostkę","Cena","Kwota do oferty [msc]"]
[null,null,null,1,"Zakup odzieży - pracownik biurowo-socjalny",null,1,210,{"$f":"IF(F6=\"\",\"\",F6*G6*H6)","v":""},{"$f":"IFERROR(I6/12,\"\")","v":""}]
[null,null,null,{"$f":"D6+1","v":2},"Zakup odzieży - pracownik magazynowo-produkcyjny",null,1,287,{"$f":"IF(F7=\"\",\"\",F7*G7*H7)","v":""},{"$f":"IFERROR(I7/12,\"\")","v":""}]
[null,null,null,{"$f":"D7+1","v":3},"Pranie strojów roboczych",null,12,20,{"$f":"IF(F8=\"\",\"\",F8*G8*H8)","v":""},""]
{"$rows_left_out":22}
{"sheet":"PODSUMOWANIE","index":12,"n_rows":23,"n_cols":10,"rows_kept":23,"cut":false,"hidden":false,"merged":[[1,1,1,3],[3,1,3,3],[13,1,13,2],[22,1,22,2],[4,6,8,6],[2,6,2,9],[18,1,18,2],[20,1,20,2]]}
[]
[null,"PODSUMOWANIE"]
[null,null,null,null,null,null,"Rentowność kontraktów"]
[null,"KOSZTY",null,null,null,null,"rodzaj usługi","Wartość usługi od","Wartość usługi do","Min. próg rentowności"]
[null,"Lp","Rodzaj kosztów","Suma",null,null,"stała",0,2000,0.35]
[null,1,"Pracownicy",{"$f":"SUM(PRACOWNICY!AC24,PRACOWNICY!Y28,PRACOWNICY!J32,PRACOWNICY!J33)","v":233.12221878000005},null,null,null,{"$f":"I5+0.01","v":2000.01},5000,0.3]
[null,{"$f":"B6+1","v":2},"Zakup maszyn",{"$f":"SUM('MASZYNY SPRZĘT'!L6:L55,'MASZYNY SPRZĘT'!L60:L79,'MASZYNY SPRZĘT'!L84:L93,'MASZYNY SPRZĘT'!L98:L102)","v":0},null,null,null,{"$f":"I6+0.01","v":5000.01},10000,0.25]
[null,{"$f":"B7+1","v":3},"Eksploatacja maszyn",{"$f":"SUM('MASZYNY SPRZĘT'!M6:M55,'MASZYNY SPRZĘT'!M60:M79,'MASZYNY SPRZĘT'!M84:M93,'MASZYNY SPRZĘT'!M98:M102)-'MASZYNY SPRZĘT'!M77","v":0},null,null,null,{"$f":"I7+0.01","v":10000.01},20000,0.23]
{"$rows_left_out":16}
{"sheet":"Karta obiektu","index":13,"n_rows":177,"n_cols":13,"rows_kept":177,"cut":false,"hidden":false,"merged":[[169,7,169,11],[170,7,170,11],[171,7,171,11],[172,7,172,11],[173,7,173,11],[174,7,174,11],[176,7,176,11],[130,5,130,11],[131,7,131,11],[132,8,132,11],[133,8,133,11],[134,8,134,11],[135,8,135,11],[131,5,131,6],[167,7,167,11],[168,7,168,11],[167,5,167,6],[168,5,168,6],[169,5,169,6],[170,5,170,6],[171,5,171,6],[172,5,172,6],[173,5,173,6],[174,5,174,6],[90,5,91,11],[118,8,119,11],[121,1,121,11],[122,5,122,11],[123,5,123,11],[124,5,124,11],[103,1,103,11],[104,5,104,11],[105,5,105,11],[106,5,106,11],[107,5,107,11],[109,8,109,11],[111,5,111,11],[112,8,112,11],[113,8,113,11],[93,8,93,11],[94,5,94,11],[98,8,98,11],[99,5,99,11],[100,1,101,4],[122,1,122,4],[114,8,114,11],[113,5,113,7],[114,5,114,7],[66,8,66,11],[67,8,67,11],[79,8,79,11],[80,8,80,11],[68,8,68,11],[69,8,69,11],[70,8,70,11],[71,8,71,11],[72,8,72,11],[73,8,73,11],[74,8,74,11],[75,8,75,11],[76,8,76,11],[77,8,77,11],[78,8,78,11],[22,6,22,11],[23,6,23,11],[28,8,28,11],[27,6,27,11],[26,6,26,11],[25,1,25,11],[19,1,19,11],[28,6,28,7],[22,2,22,4],[27,1,27,3],[27,4,27,5],[23,2,23,4],[26,1,26,3],[26,4,26,5],[20,2,20,11],[21,6,21,11],[176,5,176,6],[176,1,176,4],[107,1,107,4],[172,1,172,4],[174,1,174,4],[173,1,173,4],[169,1,169,4],[170,1,170,4],[167,1,167,4],[168,1,168,4],[171,1,171,4],[131,1,131,2],[131,3,131,4],[141,1,141,2],[141,3,141,4],[144,1,144,11],[164,1,164,6],[136,8,136,11],[137,8,137,11],[138,8,138,11],[139,8,139,11],[140,8,140,11],[141,8,141,11],[166,1,166,11],[130,1,130,4],[126,1,126,4],[127,1,127,4],[123,1,123,4],[124,1,124,4],[125,1,125,4],[117,1,117,3],[118,1,118,3],[119,1,119,3],[118,5,119,7],[125,5,125,11],[126,5,126,11],[127,5,127,11],[117,5,117,11],[104,1,104,4],[105,1,105,4],[93,5,93,7],[93,1,93,3],[106,1,106,4],[99,1,99,4],[111,1,111,4],[109,1,109,3],[112,1,112,3],[113,1,113,3],[114,1,114,3],[115,1,115,3],[115,5,115,7],[109,5,109,7],[112,5,112,7],[95,5,96,11],[100,5,101,11],[98,5,98,7],[98,1,98,3],[94,1,94,4],[34,1,34,3],[34,5,34,7],[95,1,96,4],[90,1,91,4],[89,1,89,4],[115,8,115,11],[53,8,53,11],[54,8,54,11],[55,8,55,11],[56,8,56,11],[57,8,57,11],[58,8,58,11],[59,8,59,11],[60,8,60,11],[81,8,81,11],[82,8,82,11],[83,8,83,11],[84,8,84,11],[85,8,85,11],[86,8,86,11],[36,8,36,11],[37,8,37,11],[89,5,89,11],[38,8,38,11],[39,8,39,11],[40,8,40,11],[41,8,41,11],[42,8,42,11],[88,1,88,3],[88,5,88,7],[88,8,88,11],[29,6,29,7],[30,6,30,7],[31,6,31,7],[28,1,31,1],[28,2,31,3],[33,1,33,3],[33,5,33,7],[35,1,35,4],[29,8,29,11],[30,8,30,11],[31,8,31,11],[33,8,33,11],[34,8,34,11],[35,5,35,11],[43,8,43,11],[44,8,44,11],[8,1,8,2],[11,1,11,8],[13,2,13,4],[14,2,14,4],[21,2,21,4],[18,2,18,4],[15,2,15,4],[16,2,16,4],[17,2,17,4],[10,1,10,11],[12,1,12,11],[13,6,13,11],[14,8,14,11],[15,6,15,11],[16,6,16,11],[17,6,17,11],[18,6,18,11],[61,8,61,11],[62,8,62,11],[63,8,63,11],[64,8,64,11],[52,8,52,11],[45,8,45,11],[46,8,46,11],[47,8,47,11],[48,8,48,11],[49,8,49,11],[50,8,50,11],[51,8,51,11]]}
[null,null,null,null,null,"`",null,null,null,null,null,null,"Czy chować wiersz"]
[]
[]
[]
[]
[]
[]
[]
{"$rows_left_out":170}
{"sheet":"Wykorzystanie budżetu","index":14,"n_rows":54,"n_cols":29,"rows_kept":54,"cut":false,"hidden":true,"merged":[[3,5,3,6],[3,7,3,8],[3,9,3,10],[3,11,3,12],[3,13,3,14],[3,27,3,28],[3,17,3,18],[3,19,3,20],[3,21,3,22],[3,23,3,24],[3,25,3,26],[3,15,3,16],[30,1,30,3],[17,1,17,3],[24,1,24,3],[7,1,7,3],[26,1,26,2],[19,1,19,2],[20,1,20,2],[21,1,21,2],[27,1,27,2],[8,1,8,2],[9,1,9,2],[10,1,10,2],[11,1,11,2],[25,1,25,2],[12,1,12,2],[50,1,50,2],[31,1,32,1],[33,1,34,1],[35,1,36,1],[37,1,38,1],[39,1,40,1],[13,1,13,2],[14,1,14,2],[18,1,18,2],[42,1,43,1],[46,1,46,2]]}
[null,null,null,null,null,"dodać formatowanie warunkowe"]
[null,"Początek projektu",{"$f":"'Karta obiektu'!D9","v":""}]
[null,null,null,null,"nr okresu",null,{"$f":"COUNTA($F$4:F4)","v":1},null,{"$f":"COUNTA($F$4:H4)","v":2},null,{"$f":"COUNTA($F$4:J4)","v":3},null,{"$f":"COUNTA($F$4:L4)","v":4},null,{"$f":"COUNTA($F$4:N4)","v":5},null,{"$f":"COUNTA($F$4:P4)","v":6},null,{"$f":"COUNTA($F$4:R4)","v":7},null,{"$f":"COUNTA($F$4:T4)","v":8},null,{"$f":"COUNTA($F$4:V4)","v":9},null,{"$f":"COUNTA($F$4:X4)","v":10},null,{"$f":"COUNTA($F$4:Z4)","v":11},null,{"$f":"COUNTA($F$4:AB4)","v":12}]
[null,null,null,null,null,{"$f":"C2","v":""},null,{"$f":"DATE(YEAR(F4),MONTH(F4)+1,DAY(F4))","v":{"$error":"#VALUE!"}},null,{"$f":"DATE(YEAR(H4),MONTH(H4)+1,DAY(H4))","v":{"$error":"#VALUE!"}},null,{"$f":"DATE(YEAR(J4),MONTH(J4)+1,DAY(J4))","v":{"$error":"#VALUE!"}},null,{"$f":"DATE(YEAR(L4),MONTH(L4)+1,DAY(L4))","v":{"$error":"#VALUE!"}},null,{"$f":"DATE(YEAR(N4),MONTH(N4)+1,DAY(N4))","v":{"$error":"#VALUE!"}},null,{"$f":"DATE(YEAR(P4),MONTH(P4)+1,DAY(P4))","v":{"$error":"#VALUE!"}},null,{"$f":"DATE(YEAR(R4),MONTH(R4)+1,DAY(R4))","v":{"$error":"#VALUE!"}},null,{"$f":"DATE(YEAR(T4),MONTH(T4)+1,DAY(T4))","v":{"$error":"#VALUE!"}},null,{"$f":"DATE(YEAR(V4),MONTH(V4)+1,DAY(V4))","v":{"$error":"#VALUE!"}},null,{"$f":"DATE(YEAR(X4),MONTH(X4)+1,DAY(X4))","v":{"$error":"#VALUE!"}},null,{"$f":"DATE(YEAR(Z4),MONTH(Z4)+1,DAY(Z4))","v":{"$error":"#VALUE!"}}]
[]
[null,null,null,"Różnica względem budżetu narastająco",null,"Budżet msc","Wydatki","Budżet","Wydatki","Budżet","Wydatki","Budżet","Wydatki","Budżet","Wydatki","Budżet","Wydatki","Budżet","Wydatki","Budżet","Wydatki","Budżet","Wydatki","Budżet","Wydatki","Budżet","Wydatki","Budżet","Wydatki"]
[]
[]
{"$rows_left_out":46}